Reaction Details
TargetRenin
LigandBDBM50077695
Substrate/Competitorn/a
Meas. Tech.ChEBML_195757
IC50 4±n/a nM
Citation Güller, RBinggeli, ABreu, VBur, DFischli, WHirth, GJenny, CKansy, MMontavon, FMüller, MOefner, CStadler, HVieira, EWilhelm, MWostl, WMärki, HP Piperidine-renin inhibitors compounds with improved physicochemical properties. Bioorg Med Chem Lett9:1403-8 (1999) Renin
Name:Renin
Type:Enzyme
Mol. Mass.:45058.99
Organism:Homo sapiens (Human)
Description:n/a
Residue:406
BDBM50077695
NameBDBM50077695
Synonyms:7-((3R,4R)-4-{4-[3-(2-Methoxy-benzyloxy)-propoxy]-phenyl}-piperidin-3-yloxymethyl)-quinoline | CHEMBL30618
TypeSmall organic molecule
Emp. Form.C32H36N2O4
Mol. Mass.512.6392
SMILESCOc1ccccc1COCCCOc1ccc(cc1)[C@H]1CCNC[C@@H]1OCc1ccc2cccnc2c1