Reaction Details
TargetRenin
LigandBDBM50077707
Substrate/Competitorn/a
Meas. Tech.ChEBML_195757
IC50 9±n/a nM
Citation Güller, RBinggeli, ABreu, VBur, DFischli, WHirth, GJenny, CKansy, MMontavon, FMüller, MOefner, CStadler, HVieira, EWilhelm, MWostl, WMärki, HP Piperidine-renin inhibitors compounds with improved physicochemical properties. Bioorg Med Chem Lett9:1403-8 (1999) Renin
Name:Renin
Type:Enzyme
Mol. Mass.:45058.99
Organism:Homo sapiens (Human)
Description:n/a
Residue:406
BDBM50077707
NameBDBM50077707
Synonyms:(3R,4S,5R)-4-[4-(3-Benzyloxy-propoxy)-phenyl]-5-(naphthalen-2-ylmethoxy)-piperidin-3-ol | CHEMBL31428
TypeSmall organic molecule
Emp. Form.C32H35NO4
Mol. Mass.497.6246
SMILESO[C@H]1CNC[C@H](OCc2ccc3ccccc3c2)[C@H]1c1ccc(OCCCOCc2ccccc2)cc1