Reaction Details
TargetDihydrofolate reductase
LigandBDBM50077797
Substrate/Competitorn/a
Meas. Tech.ChEMBL_53605 (CHEMBL664356)
Ki 46±n/a nM
Citation Zuccotto, FBrun, RGonzalez Pacanowska, DRuiz Perez, LMGilbert, IH The structure-based design and synthesis of selective inhibitors of Trypanosoma cruzi dihydrofolate reductase. Bioorg Med Chem Lett9:1463-8 (1999) Dihydrofolate reductase
Name:Dihydrofolate reductase
Type:Enzyme
Mol. Mass.:21453.99
Organism:Homo sapiens (Human)
Description:Recombinant human DHFR.
Residue:187
BDBM50077797
NameBDBM50077797
Synonyms:2-{4-[(2,4-Diamino-pteridin-6-ylmethyl)-(4-ethoxycarbonyl-butyl)-amino]-benzoylamino}-pentanedioic acid diethyl ester | CHEMBL35552
TypeSmall organic molecule
Emp. Form.C30H40N8O7
Mol. Mass.624.688
SMILESCCOC(=O)CCCCN(Cc1cnc2nc(N)nc(N)c2n1)c1ccc(cc1)C(=O)NC(CCC(=O)OCC)C(=O)OCC