Reaction Details
TargetDihydrofolate reductase
LigandBDBM50077794
Substrate/Competitorn/a
Meas. Tech.ChEMBL_53605 (CHEMBL664356)
Ki 14±n/a nM
Citation Zuccotto, FBrun, RGonzalez Pacanowska, DRuiz Perez, LMGilbert, IH The structure-based design and synthesis of selective inhibitors of Trypanosoma cruzi dihydrofolate reductase. Bioorg Med Chem Lett9:1463-8 (1999) Dihydrofolate reductase
Name:Dihydrofolate reductase
Type:Enzyme
Mol. Mass.:21453.99
Organism:Homo sapiens (Human)
Description:Recombinant human DHFR.
Residue:187
BDBM50077794
NameBDBM50077794
Synonyms:2-{4-[(2,4-Diamino-pteridin-6-ylmethyl)-(3-ethoxycarbonyl-propyl)-amino]-benzoylamino}-pentanedioic acid diethyl ester | CHEMBL285474
TypeSmall organic molecule
Emp. Form.C29H38N8O7
Mol. Mass.610.6614
SMILESCCOC(=O)CCCN(Cc1cnc2nc(N)nc(N)c2n1)c1ccc(cc1)C(=O)NC(CCC(=O)OCC)C(=O)OCC