Reaction Details
TargetDihydrofolate reductase
LigandBDBM50077798
Substrate/Competitorn/a
Meas. Tech.ChEMBL_53605 (CHEMBL664356)
Ki 0.107000±n/a nM
Citation Zuccotto, FBrun, RGonzalez Pacanowska, DRuiz Perez, LMGilbert, IH The structure-based design and synthesis of selective inhibitors of Trypanosoma cruzi dihydrofolate reductase. Bioorg Med Chem Lett9:1463-8 (1999) Dihydrofolate reductase
Name:Dihydrofolate reductase
Type:Enzyme
Mol. Mass.:21453.99
Organism:Homo sapiens (Human)
Description:Recombinant human DHFR.
Residue:187
BDBM50077798
NameBDBM50077798
Synonyms:2-{4-[(3-Carboxy-propyl)-(2,4-diamino-pteridin-6-ylmethyl)-amino]-benzoylamino}-pentanedioic acid | CHEMBL35364
TypeSmall organic molecule
Emp. Form.C23H26N8O7
Mol. Mass.526.5019
SMILESNc1nc(N)c2nc(CN(CCCC(O)=O)c3ccc(cc3)C(=O)NC(CCC(O)=O)C(O)=O)cnc2n1