Reaction Details
TargetThymidylate synthase
LigandBDBM50077841
Substrate/Competitorn/a
Meas. Tech.ChEMBL_209135 (CHEMBL814653)
Ki 1700±n/a nM
Citation Costi, PMRinaldi, MTondi, DPecorari, PBarlocco, DGhelli, SStroud, RMSanti, DVStout, TJMusiu, CMarangiu, EMPani, ACongiu, DLoi, GALa Colla, P Phthalein derivatives as a new tool for selectivity in thymidylate synthase inhibition. J Med Chem42:2112-24 (1999) 
 
Thymidylate synthase
Name:Thymidylate synthase
Type:Enzyme
Mol. Mass.:30475.81
Organism:Escherichia coli
Description:n/a
Residue:264
BDBM50077841
NameBDBM50077841
Synonyms:6-Bromo-3,3-bis-(4-hydroxy-phenyl)-3H-benzo[de]isochromen-1-one; compound with 7-bromo-3,3-bis-(4-hydroxy-phenyl)-3H-benzo[de]isochromen-1-one | CHEMBL68299
TypeSmall organic molecule
Emp. Form.C24H15BrO4
Mol. Mass.447.278
SMILESOc1ccc(cc1)C1(OC(=O)c2cccc3c(Br)ccc1c23)c1ccc(O)cc1