Reaction Details
TargetThymidylate synthase
LigandBDBM50077844
Substrate/Competitorn/a
Meas. Tech.ChEMBL_209135 (CHEMBL814653)
Ki 4700±n/a nM
Citation Costi, PMRinaldi, MTondi, DPecorari, PBarlocco, DGhelli, SStroud, RMSanti, DVStout, TJMusiu, CMarangiu, EMPani, ACongiu, DLoi, GALa Colla, P Phthalein derivatives as a new tool for selectivity in thymidylate synthase inhibition. J Med Chem42:2112-24 (1999) 
 
Thymidylate synthase
Name:Thymidylate synthase
Type:Enzyme
Mol. Mass.:30475.81
Organism:Escherichia coli
Description:n/a
Residue:264
BDBM50077844
NameBDBM50077844
Synonyms:3,3-Bis-(4-hydroxy-phenyl)-3H-isobenzofuran-1-one Phenolphthalein cid_4764
TypeSmall organic molecule
Emp. Form.C20H14O4
Mol. Mass.318.3228
SMILESOc1ccc(cc1)C1(OC(=O)c2ccccc12)c1ccc(O)cc1