Reaction Details
TargetThymidylate synthase
LigandBDBM50077849
Substrate/Competitorn/a
Meas. Tech.ChEMBL_209135 (CHEMBL814653)
Ki 1000±n/a nM
Citation Costi, PMRinaldi, MTondi, DPecorari, PBarlocco, DGhelli, SStroud, RMSanti, DVStout, TJMusiu, CMarangiu, EMPani, ACongiu, DLoi, GALa Colla, P Phthalein derivatives as a new tool for selectivity in thymidylate synthase inhibition. J Med Chem42:2112-24 (1999) 
 
Thymidylate synthase
Name:Thymidylate synthase
Type:Enzyme
Mol. Mass.:30475.81
Organism:Escherichia coli
Description:n/a
Residue:264
BDBM50077849
NameBDBM50077849
Synonyms:3,3-Bis-(4-hydroxy-phenyl)-6-nitro-3H-benzo[de]isochromen-1-one CHEMBL303950
TypeSmall organic molecule
Emp. Form.C24H15NO6
Mol. Mass.413.379
SMILESOc1ccc(cc1)C1(OC(=O)c2cccc3c(ccc1c23)[N+]([O-])=O)c1ccc(O)cc1