Reaction Details
TargetMuscarinic acetylcholine receptor M1
LigandBDBM50061560
Substrate/Competitorn/a
Meas. Tech.ChEMBL_138290 (CHEMBL744322)
IC50 35±n/a nM
Citation Liao, YVenhuis, BJRodenhuis, NTimmerman, WWikström, HMeier, EBartoszyk, GDBöttcher, HSeyfried, CASundell, S New (sulfonyloxy)piperazinyldibenzazepines as potential atypical antipsychotics: chemistry and pharmacological evaluation. J Med Chem42:2235-44 (1999) 
 
Muscarinic acetylcholine receptor M1
Name:Muscarinic acetylcholine receptor M1
Type:Protein
Mol. Mass.:51442.54
Organism:Homo sapiens (Human)
Description:P11229
Residue:460
BDBM50061560
NameBDBM50061560
Synonyms:CHEMBL310712 | Trifluoro-methanesulfonic acid 11-(4-methyl-piperazin-1-yl)-5H-dibenzo[b,e][1,4]diazepin-8-yl ester
TypeSmall organic molecule
Emp. Form.C19H19F3N4O3S
Mol. Mass.440.439
SMILESCN1CCN(CC1)C1=Nc2cc(OS(=O)(=O)C(F)(F)F)ccc2Nc2ccccc12