Reaction Details
TargetD(2) dopamine receptor
LigandBDBM50078062
Substrate/Competitorn/a
Meas. Tech.ChEMBL_59916 (CHEMBL671075)
IC50 52±n/a nM
Citation Liao, YVenhuis, BJRodenhuis, NTimmerman, WWikström, HMeier, EBartoszyk, GDBöttcher, HSeyfried, CASundell, S New (sulfonyloxy)piperazinyldibenzazepines as potential atypical antipsychotics: chemistry and pharmacological evaluation. J Med Chem42:2235-44 (1999) 
 
D(2) dopamine receptor
Name:D(2) dopamine receptor
Type:Cell-surface receptors
Mol. Mass.:50647.10
Organism:Homo sapiens (Human)
Description:P14416
Residue:443
BDBM50078062
NameBDBM50078062
Synonyms:CHEMBL430798 | Trifluoro-methanesulfonic acid 11-(4-methyl-piperazin-1-yl)-dibenzo[b,f][1,4]oxazepin-2-yl ester
TypeSmall organic molecule
Emp. Form.C19H18F3N3O4S
Mol. Mass.441.424
SMILESCN1CCN(CC1)C1=Nc2ccccc2Oc2ccc(OS(=O)(=O)C(F)(F)F)cc12