Reaction Details
TargetD(4) dopamine receptor
LigandBDBM22871
Substrate/Competitorn/a
Meas. Tech.ChEMBL_61012 (CHEMBL675017)
IC50 14±n/a nM
Citation Liao, YVenhuis, BJRodenhuis, NTimmerman, WWikström, HMeier, EBartoszyk, GDBöttcher, HSeyfried, CASundell, S New (sulfonyloxy)piperazinyldibenzazepines as potential atypical antipsychotics: chemistry and pharmacological evaluation. J Med Chem42:2235-44 (1999) 
 
D(4) dopamine receptor
Name:D(4) dopamine receptor
Type:Enzyme
Mol. Mass.:48373.19
Organism:Homo sapiens (Human)
Description:P21917
Residue:419
BDBM22871
NameBDBM22871
Synonyms:13-chloro-10-(4-methylpiperazin-1-yl)-2-oxa-9-azatricyclo[9.4.0.0^{3,8}]pentadeca-1(11),3,5,7,9,12,14-heptaene 8-chloro-6-(4-methylpiperazino)benzo[b][1,4]benzoxazepine;succinic acid CL71,563 Loxapine
TypeSmall organic molecule
Emp. Form.C18H18ClN3O
Mol. Mass.327.808
SMILESCN1CCN(CC1)C1=Nc2ccccc2Oc2ccc(Cl)cc12