Reaction Details
Target5-hydroxytryptamine receptor 2A
LigandBDBM50061558
Substrate/Competitorn/a
Meas. Tech.ChEMBL_2584 (CHEMBL617605)
IC50 12±n/a nM
Citation Liao, YVenhuis, BJRodenhuis, NTimmerman, WWikström, HMeier, EBartoszyk, GDBöttcher, HSeyfried, CASundell, S New (sulfonyloxy)piperazinyldibenzazepines as potential atypical antipsychotics: chemistry and pharmacological evaluation. J Med Chem42:2235-44 (1999) 
 
5-hydroxytryptamine receptor 2A
Name:5-hydroxytryptamine receptor 2A
Type:G Protein-Coupled Receptor (GPCR)
Mol. Mass.:52852.05
Organism:Rattus norvegicus (rat)
Description:Rat cortex membranes 5-HT2A receptors.
Residue:471
BDBM50061558
NameBDBM50061558
Synonyms:2-Methoxy-11-(4-methyl-piperazin-1-yl)-5H-dibenzo[b,e][1,4]diazepine | CHEMBL72794
TypeSmall organic molecule
Emp. Form.C19H22N4O
Mol. Mass.322.4042
SMILESCOc1ccc2Nc3ccccc3N=C(N3CCN(C)CC3)c2c1