Reaction Details
TargetMetabotropic glutamate receptor 2
LigandBDBM50078236
Substrate/Competitorn/a
Meas. Tech.ChEMBL_106214 (CHEMBL713202)
Ki 2400±n/a nM
Citation Wichmann, JAdam, GKolczewski, SMutel, VWoltering, T Structure-activity relationships of substituted 5H-thiazolo[3,2-a]pyrimidines as group 2 metabotropic glutamate receptor antagonists. Bioorg Med Chem Lett9:1573-6 (1999) Metabotropic glutamate receptor 2
Name:Metabotropic glutamate receptor 2
Type:PROTEIN
Mol. Mass.:95786.41
Organism:Rattus norvegicus
Description:ChEMBL_105034
Residue:872
BDBM50078236
NameBDBM50078236
Synonyms:2-(2,6-Dichloro-phenyl)-5-(2-methoxy-phenyl)-7-methyl-5H-thiazolo[3,2-a]pyrimidine-6-carboxylic acid 3-dimethylamino-propyl ester | CHEMBL289394
TypeSmall organic molecule
Emp. Form.C26H27Cl2N3O3S
Mol. Mass.532.482
SMILESCOc1ccccc1C1N2C=C(SC2=NC(C)=C1C(=O)OCCCN(C)C)c1c(Cl)cccc1Cl