Reaction Details
TargetMetabotropic glutamate receptor 2
LigandBDBM50078237
Substrate/Competitorn/a
Meas. Tech.ChEMBL_106214 (CHEMBL713202)
Ki 2000±n/a nM
Citation Wichmann, JAdam, GKolczewski, SMutel, VWoltering, T Structure-activity relationships of substituted 5H-thiazolo[3,2-a]pyrimidines as group 2 metabotropic glutamate receptor antagonists. Bioorg Med Chem Lett9:1573-6 (1999) Metabotropic glutamate receptor 2
Name:Metabotropic glutamate receptor 2
Type:PROTEIN
Mol. Mass.:95786.41
Organism:Rattus norvegicus
Description:ChEMBL_105034
Residue:872
BDBM50078237
NameBDBM50078237
Synonyms:5-(2-Chloro-phenyl)-2-(2,6-dichloro-phenyl)-7-methyl-5H-thiazolo[3,2-a]pyrimidine-6-carboxylic acid 2-dimethylamino-ethyl ester | CHEMBL41513
TypeSmall organic molecule
Emp. Form.C24H22Cl3N3O2S
Mol. Mass.522.874
SMILESCN(C)CCOC(=O)C1=C(C)N=C2SC(=CN2C1c1ccccc1Cl)c1c(Cl)cccc1Cl