Reaction Details
TargetScytalone dehydratase
LigandBDBM50078273
Substrate/Competitorn/a
Meas. Tech.ChEBML_199522
Ki 7.5±n/a nM
Citation Jordan, DBLessen, TAWawrzak, ZBisaha, JJGehret, TCHansen, SLSchwartz, RSBasarab, GS Design of scytalone dehydratase inhibitors as rice blast fungicides: (N-phenoxypropyl)-carboxamides. Bioorg Med Chem Lett9:1607-12 (1999) Scytalone dehydratase
Name:Scytalone dehydratase
Type:PROTEIN
Mol. Mass.:20248.63
Organism:Magnaporthe grisea
Description:ChEMBL_199536
Residue:172
BDBM50078273
NameBDBM50078273
Synonyms:(R)-2,2-Dichloro-1-ethyl-3-methyl-cyclopropanecarboxylic acid (2-phenoxy-ethyl)-amide | CHEMBL41569
TypeSmall organic molecule
Emp. Form.C15H19Cl2NO2
Mol. Mass.316.223
SMILESCC[C@@]1(C(C)C1(Cl)Cl)C(=O)NCCOc1ccccc1