Reaction Details
TargetScytalone dehydratase
LigandBDBM50078276
Substrate/Competitorn/a
Meas. Tech.ChEBML_199522
Ki 66±n/a nM
Citation Jordan, DBLessen, TAWawrzak, ZBisaha, JJGehret, TCHansen, SLSchwartz, RSBasarab, GS Design of scytalone dehydratase inhibitors as rice blast fungicides: (N-phenoxypropyl)-carboxamides. Bioorg Med Chem Lett9:1607-12 (1999) Scytalone dehydratase
Name:Scytalone dehydratase
Type:PROTEIN
Mol. Mass.:20248.63
Organism:Magnaporthe grisea
Description:ChEMBL_199536
Residue:172
BDBM50078276
NameBDBM50078276
Synonyms:(S)-2-Cyano-3,3-dimethyl-N-((R)-1-methyl-2-phenoxy-ethyl)-butyramide | CHEMBL290146
TypeSmall organic molecule
Emp. Form.C16H22N2O2
Mol. Mass.274.3581
SMILESC[C@H](COc1ccccc1)NC(=O)[C@H](C#N)C(C)(C)C