Reaction Details
TargetScytalone dehydratase
LigandBDBM50078281
Substrate/Competitorn/a
Meas. Tech.ChEBML_199522
Ki 0.042000±n/a nM
Citation Jordan, DBLessen, TAWawrzak, ZBisaha, JJGehret, TCHansen, SLSchwartz, RSBasarab, GS Design of scytalone dehydratase inhibitors as rice blast fungicides: (N-phenoxypropyl)-carboxamides. Bioorg Med Chem Lett9:1607-12 (1999) Scytalone dehydratase
Name:Scytalone dehydratase
Type:PROTEIN
Mol. Mass.:20248.63
Organism:Magnaporthe grisea
Description:ChEMBL_199536
Residue:172
BDBM50078281
NameBDBM50078281
Synonyms:2-Cyano-N-[(R)-2-(2,5-difluoro-phenoxy)-1-methyl-ethyl]-3,3-dimethyl-butyramide | CHEMBL295533
TypeSmall organic molecule
Emp. Form.C16H20F2N2O2
Mol. Mass.310.339
SMILESC[C@H](COc1cc(F)ccc1F)NC(=O)C(C#N)C(C)(C)C