Reaction Details
TargetScytalone dehydratase
LigandBDBM50078306
Substrate/Competitorn/a
Meas. Tech.ChEBML_199523
Ki 0.038±n/a nM
Citation Basarab, GSJordan, DBGehret, TCSchwartz, RSWawrzak, Z Design of scytalone dehydratase inhibitors as rice blast fungicides: derivatives of norephedrine. Bioorg Med Chem Lett9:1613-8 (1999) Scytalone dehydratase
Name:Scytalone dehydratase
Type:PROTEIN
Mol. Mass.:20248.63
Organism:Magnaporthe grisea
Description:ChEMBL_199536
Residue:172
BDBM50078306
NameBDBM50078306
Synonyms:2-Cyano-N-[(1R,2S)-2-(2-cyano-phenoxy)-1-methyl-2-phenyl-ethyl]-3-methyl-butyramide | CHEMBL418441
TypeSmall organic molecule
Emp. Form.C22H23N3O2
Mol. Mass.361.4369
SMILESCC(C)C(C#N)C(=O)N[C@H](C)[C@@H](Oc1ccccc1C#N)c1ccccc1