Reaction Details
TargetCorticotropin-releasing factor receptor 1
LigandBDBM50054253
Substrate/Competitorn/a
Meas. Tech.ChEMBL_50976 (CHEMBL663519)
Ki 3.8±n/a nM
Citation Keller, PABowman, MDang, KHGarner, JLeach, SPSmith, RMcCluskey, A Pharmacophore development for corticotropin-releasing hormone: new insights into inhibitor activity. J Med Chem42:2351-7 (1999) 
 
Corticotropin-releasing factor receptor 1
Name:Corticotropin-releasing factor receptor 1
Type:Enzyme
Mol. Mass.:50744.31
Organism:Homo sapiens (Human)
Description:P34998
Residue:444
BDBM50054253
NameBDBM50054253
Synonyms:CHEMBL77716 | N-Cyclopropylmethyl-5-ethyl-2-methyl-N-propyl-N'-(2,4,6-trichloro-phenyl)-pyrimidine-4,6-diamine
TypeSmall organic molecule
Emp. Form.C20H25Cl3N4
Mol. Mass.427.798
SMILESCCCN(CC1CC1)c1nc(C)nc(Nc2c(Cl)cc(Cl)cc2Cl)c1CC