Reaction Details
TargetCorticotropin-releasing factor receptor 1
LigandBDBM50054235
Substrate/Competitorn/a
Meas. Tech.ChEMBL_50976 (CHEMBL663519)
Ki>10000±n/a nM
Citation Keller, PABowman, MDang, KHGarner, JLeach, SPSmith, RMcCluskey, A Pharmacophore development for corticotropin-releasing hormone: new insights into inhibitor activity. J Med Chem42:2351-7 (1999) 
 
Corticotropin-releasing factor receptor 1
Name:Corticotropin-releasing factor receptor 1
Type:Enzyme
Mol. Mass.:50744.31
Organism:Homo sapiens (Human)
Description:P34998
Residue:444
BDBM50054235
NameBDBM50054235
Synonyms:CHEMBL78203 | N-Cyclopropylmethyl-6-ethyl-N-propyl-N'-(2,4,6-trimethyl-phenyl)-[1,3,5]triazine-2,4-diamine
TypeSmall organic molecule
Emp. Form.C21H31N5
Mol. Mass.353.5043
SMILESCCCN(CC1CC1)c1nc(CC)nc(Nc2c(C)cc(C)cc2C)n1