Reaction Details
TargetXaa-Pro aminopeptidase 2
LigandBDBM50078391
Substrate/Competitorn/a
Meas. Tech.ChEMBL_35520 (CHEMBL644753)
IC50 11000±n/a nM
Citation Maggiora, LLOrawski, ATSimmons, WH Apstatin analogue inhibitors of aminopeptidase P, a bradykinin-degrading enzyme. J Med Chem42:2394-402 (1999) 
 
Xaa-Pro aminopeptidase 2
Name:Xaa-Pro aminopeptidase 2
Type:Enzyme
Mol. Mass.:75618.88
Organism:Homo sapiens (Human)
Description:O43895
Residue:674
BDBM50078391
NameBDBM50078391
Synonyms:(S)-1-[(R)-3-((2S,3R)-3-Amino-2-hydroxy-4-phenyl-butyryl)-thiazolidine-4-carbonyl]-pyrrolidine-2-carboxylic acid ((S)-1-carbamoyl-ethyl)-amide | CHEMBL79092
TypeSmall organic molecule
Emp. Form.C22H31N5O5S
Mol. Mass.477.577
SMILESC[C@H](NC(=O)[C@@H]1CCCN1C(=O)[C@@H]1CSCN1C(=O)[C@@H](O)[C@H](N)Cc1ccccc1)C(N)=O