Reaction Details
TargetXaa-Pro aminopeptidase 2
LigandBDBM50078397
Substrate/Competitorn/a
Meas. Tech.ChEMBL_35520 (CHEMBL644753)
IC50 230±n/a nM
Citation Maggiora, LLOrawski, ATSimmons, WH Apstatin analogue inhibitors of aminopeptidase P, a bradykinin-degrading enzyme. J Med Chem42:2394-402 (1999) 
 
Xaa-Pro aminopeptidase 2
Name:Xaa-Pro aminopeptidase 2
Type:Enzyme
Mol. Mass.:75618.88
Organism:Homo sapiens (Human)
Description:O43895
Residue:674
BDBM50078397
NameBDBM50078397
Synonyms:1-(3-Amino-2-hydroxy-5-methyl-hexanoyl)-pyrrolidine-2-carboxylic acid (1-carbamoyl-ethyl)-amide | CHEMBL420207
TypeSmall organic molecule
Emp. Form.C15H28N4O4
Mol. Mass.328.4072
SMILESCC(C)C[C@@H](N)C(O)C(=O)N1CCC[C@H]1C(=O)N[C@@H](C)C(N)=O