Reaction Details
TargetPurine nucleoside phosphorylase
LigandBDBM50039542
Substrate/Competitorn/a
Meas. Tech.ChEMBL_162028 (CHEMBL873419)
Ki 3.1±n/a nM
Citation Farutin, VMasterson, LAndricopulo, ADCheng, JRiley, BHakimi, RFrazer, JWCordes, EH Structure-activity relationships for a class of inhibitors of purine nucleoside phosphorylase. J Med Chem42:2422-31 (1999) 
 
Purine nucleoside phosphorylase
Name:Purine nucleoside phosphorylase
Type:Enzyme
Mol. Mass.:32035.18
Organism:Bos taurus (bovine)
Description:n/a
Residue:289
BDBM50039542
NameBDBM50039542
Synonyms:2-Amino-7-pyridin-3-ylmethyl-3,5-dihydro-pyrrolo[3,2-d]pyrimidin-4-one 2-amino-7-(pyridin-3-ylmethyl)-3H-pyrrolo[3,2-d]pyrimidin-4(5H)-one | CHEMBL311300
TypeSmall organic molecule
Emp. Form.C12H11N5O
Mol. Mass.241.2486
SMILESNc1nc2c(Cc3cccnc3)c[nH]c2c(=O)[nH]1