Reaction Details
TargetPurine nucleoside phosphorylase
LigandBDBM50046213
Substrate/Competitorn/a
Meas. Tech.ChEMBL_162028 (CHEMBL873419)
Ki 1.7±n/a nM
Citation Farutin, VMasterson, LAndricopulo, ADCheng, JRiley, BHakimi, RFrazer, JWCordes, EH Structure-activity relationships for a class of inhibitors of purine nucleoside phosphorylase. J Med Chem42:2422-31 (1999) 
 
Purine nucleoside phosphorylase
Name:Purine nucleoside phosphorylase
Type:Enzyme
Mol. Mass.:32035.18
Organism:Bos taurus (bovine)
Description:n/a
Residue:289
BDBM50046213
NameBDBM50046213
Synonyms:2-Amino-7-(3-hydroxy-benzyl)-3,5-dihydro-pyrrolo[3,2-d]pyrimidin-4-one | CHEMBL82087
TypeSmall organic molecule
Emp. Form.C13H12N4O2
Mol. Mass.256.26
SMILESNc1nc2c(Cc3cccc(O)c3)c[nH]c2c(=O)[nH]1