Reaction Details
TargetProthrombin
LigandBDBM50078558
Substrate/Competitorn/a
Meas. Tech.ChEBML_208128
IC50 13000±n/a nM
Citation Pass, MAbu-Rabie, SBaxter, AConroy, RCoote, SJCraven, APFinch, HHindley, SKelly, HALowdon, AWMcDonald, EMitchell, WLPegg, NAProcopiou, PARamsden, NGThomas, RWalker, DAWatson, NSJhoti, HMooney, CJTang, CMThomas, PJParry, SPatel, C Thrombin inhibitors based on [5,5] trans-fused indane lactams. Bioorg Med Chem Lett9:1657-62 (1999) Prothrombin
Name:Prothrombin
Type:Protein
Mol. Mass.:70029.57
Organism:Homo sapiens (Human)
Description:P00734
Residue:622
BDBM50078558
NameBDBM50078558
Synonyms:5-[(3R,3aS,8aS)-2-Oxo-1-(5-phenyl-pentyl)-1,2,3,3a,8,8a-hexahydro-indeno[2,1-b]pyrrol-3-yl]-pentanamidine | CHEMBL46923
TypeSmall organic molecule
Emp. Form.C27H35N3O
Mol. Mass.417.5863
SMILESNC(=N)CCCC[C@@H]1[C@@H]2[C@H](Cc3ccccc23)N(CCCCCc2ccccc2)C1=O