Reaction Details
TargetSerine protease 1
LigandBDBM50078554
Substrate/Competitorn/a
Meas. Tech.ChEBML_212712
IC50 30±n/a nM
Citation Pass, MAbu-Rabie, SBaxter, AConroy, RCoote, SJCraven, APFinch, HHindley, SKelly, HALowdon, AWMcDonald, EMitchell, WLPegg, NAProcopiou, PARamsden, NGThomas, RWalker, DAWatson, NSJhoti, HMooney, CJTang, CMThomas, PJParry, SPatel, C Thrombin inhibitors based on [5,5] trans-fused indane lactams. Bioorg Med Chem Lett9:1657-62 (1999) Serine protease 1
Name:Serine protease 1
Type:Enzyme
Mol. Mass.:26557.80
Organism:Homo sapiens (Human)
Description:P07477
Residue:247
BDBM50078554
NameBDBM50078554
Synonyms:(3R,3aS,8aS)-3-(4-Carbamimidoyl-butyl)-6-(3-diethylcarbamoyl-phenyl)-2-oxo-3,3a,8,8a-tetrahydro-2H-indeno[2,1-b]pyrrole-1-carboxylic acid methyl ester | CHEMBL46845
TypeSmall organic molecule
Emp. Form.C29H36N4O4
Mol. Mass.504.6205
SMILESCCN(CC)C(=O)c1cccc(c1)-c1ccc2[C@H]3[C@H](Cc2c1)N(C(=O)OC)C(=O)[C@@H]3CCCCC(N)=N