Reaction Details
TargetProtein kinase C alpha type
LigandBDBM50078564
Substrate/Competitorn/a
Meas. Tech.ChEBML_160441
Ki>500±n/a nM
Citation Wender, PALippa, BPark, CMIrie, KNakahara, AOhigashi, H Selective binding of bryostatin analogues to the cysteine rich domains of protein kinase C isozymes. Bioorg Med Chem Lett9:1687-90 (1999) Protein kinase C alpha type
Name:Protein kinase C alpha type
Type:Enzyme
Mol. Mass.:76755.65
Organism:Homo sapiens (Human)
Description:The recombinant human PKC enzymes were produced using a baculovirus expression system in SF9 cells
Residue:672
BDBM50078564
NameBDBM50078564
Synonyms:CHEMBL45053 | Octanoic acid (E)-(1S,5S,9S,11S,15R,19R,24S)-11-tert-butyl-1,15-dihydroxy-19-((R)-1-hydroxy-ethyl)-23-methoxycarbonylmethylene-2,2-dimethyl-17-oxo-6,12,18,25,26-pentaoxa-tricyclo[19.3.1.1*5,9*]hexacos-3-en-24-yl ester
TypeSmall organic molecule
Emp. Form.C40H66O13
Mol. Mass.754.9442
SMILESCCCCCCCC(=O)O[C@H]1\C(CC2C[C@@H](OC(=O)C[C@H](O)CCO[C@@H](C[C@@H]3CCO[C@@H](O3)\C=C\C(C)(C)[C@]1(O)O2)C(C)(C)C)[C@@H](C)O)=C\C(=O)OC