Reaction Details
TargetProstaglandin G/H synthase 2
LigandBDBM50029600
Substrate/Competitorn/a
Meas. Tech.ChEMBL_159767 (CHEMBL763092)
IC50<200±n/a nM
Citation Dubé, DBrideau, CDeschênes, DFortin, RFriesen, RWGordon, RGirard, YRiendeau, DSavoie, CChan, CC 2-heterosubstituted-3-(4-methylsulfonyl)phenyl-5-trifluoromethyl pyridines as selective and orally active cyclooxygenase-2 inhibitors. Bioorg Med Chem Lett9:1715-20 (1999) Prostaglandin G/H synthase 2
Name:Prostaglandin G/H synthase 2
Type:Enzyme
Mol. Mass.:69003.89
Organism:Homo sapiens (Human)
Description:Recombinant Cox-2 provided by Cayman (Cayman Chemical Co.,Ann Arbor, MI).
Residue:604
BDBM50029600
NameBDBM50029600
Synonyms:5-Bromo-2-(4-fluoro-phenyl)-3-(4-methanesulfonyl-phenyl)-thiophene CHEMBL42485 | DUP-697
TypeSmall organic molecule
Emp. Form.C17H12BrFO2S2
Mol. Mass.411.308
SMILESCS(=O)(=O)c1ccc(cc1)-c1cc(Br)sc1-c1ccc(F)cc1