Reaction Details
TargetVasopressin V1a receptor
LigandBDBM50078663
Substrate/Competitorn/a
Meas. Tech.ChEBML_214559
IC50 33±n/a nM
Citation Aranapakam, VAlbright, JDGrosu, GTDelos Santos, EGChan, PSCoupet, JRu, XSaunders, TMazandarani, H 5-fluoro-2-methyl-N-[5-(5H-pyrrolo[2,1-c][1,4]benzodiazepine-10(11H)-yl carbonyl)-2-pyridinyl]benzamide (CL-385004) and analogs as orally active arginine vasopressin receptor antagonists. Bioorg Med Chem Lett9:1737-40 (1999) Vasopressin V1a receptor
Name:Vasopressin V1a receptor
Type:Enzyme Catalytic Domain
Mol. Mass.:47674.81
Organism:RAT
Description:VASOPRESSIN V1A AVPR1A RAT::P30560
Residue:424
BDBM50078663
NameBDBM50078663
Synonyms:CHEMBL300946 | N-[5-(5H,11H-Benzo[e]pyrrolo[1,2-a][1,4]diazepine-10-carbonyl)-pyridin-2-yl]-5-fluoro-2-methyl-benzamide
TypeSmall organic molecule
Emp. Form.C26H21FN4O2
Mol. Mass.440.4689
SMILESCc1ccc(F)cc1C(=O)Nc1ccc(cn1)C(=O)N1Cc2cccn2Cc2ccccc12