Reaction Details
TargetIntegrin alpha-V/beta-1
LigandBDBM50078714
Substrate/Competitorn/a
Meas. Tech.ChEBML_215993
Ki 18000±n/a nM
Citation Miller, WHBondinell, WECousins, RDErhard, KFJakas, DRKeenan, RMKu, TWNewlander, KARoss, STHaltiwanger, RCBradbeer, JDrake, FHGowen, MHoffman, SJHwang, SMJames, IELark, MWLechowska, BRieman, DJStroup, GBVasko-Moser, JAZembryki, DLAzzarano, LMAdams, PCHuffman, WF Orally bioavailable nonpeptide vitronectin receptor antagonists with efficacy in an osteoporosis model. Bioorg Med Chem Lett9:1807-12 (1999) Integrin alpha-V/beta-1
Name:Integrin alpha-V/beta-1
Type:Enzyme
Mol. Mass.:n/a
Description:n/a
Components:This complex has 2 components.
Component 1
Name:Integrin alpha-V
Synonyms:ITAV_HUMAN Integrin alpha-V/alpha-5 VNRA Vitronectin receptor | Vitronectin receptor subunit alpha
Type:PROTEIN
Mol. Mass.:116024.92
Organism:Homo sapiens (Human)
Description:ChEMBL_582336
Residue:1048
Component 2
Name:Integrin beta-1
Synonyms:CD_antigen=CD29 Fibronectin receptor beta GPIIA ITGB1 MDF2 | MSK12
Type:Enzyme
Mol. Mass.:88400.38
Organism:Homo sapiens (Human)
Description:P05556
Residue:798
BDBM50078714
NameBDBM50078714
Synonyms:CHEMBL288493 {(S)-3-[3-(Pyridin-2-ylamino)-propoxy]-10,11-dihydro-5H-dibenzo[a,d]cyclohepten-10-yl}-acetic acid | {3-[3-(Pyridin-2-ylamino)-propoxy]-10,11-dihydro-5H-dibenzo[a,d]cyclohepten-10-yl}-acetic acid
TypeSmall organic molecule
Emp. Form.C25H26N2O3
Mol. Mass.402.4855
SMILESOC(=O)C[C@@H]1Cc2ccc(OCCCNc3ccccn3)cc2Cc2ccccc12