Reaction Details
TargetVoltage-dependent N-type calcium channel subunit alpha-1B
LigandBDBM50078725
Substrate/Competitorn/a
Meas. Tech.ChEBML_141444
IC50 320±n/a nM
Citation Ryder, TRHu, LYRafferty, MFMillerman, ESzoke, BGTarczy-Hornoch, K Multiple parallel synthesis of N,N-dialkyldipeptidylamines as N-type calcium channel blockers. Bioorg Med Chem Lett9:1813-8 (1999) Voltage-dependent N-type calcium channel subunit alpha-1B
Name:Voltage-dependent N-type calcium channel subunit alpha-1B
Type:Enzyme
Mol. Mass.:262548.16
Organism:Homo sapiens (Human)
Description:Q00975
Residue:2339
BDBM50078725
NameBDBM50078725
Synonyms:(S)-4-Methyl-2-[methyl-(3-methyl-butyl)-amino]-pentanoic acid [(S)-2-(4-benzyloxy-phenyl)-1-tert-butylcarbamoyl-ethyl]-amide | CHEMBL292011
TypeSmall organic molecule
Emp. Form.C32H49N3O3
Mol. Mass.523.7498
SMILESCC(C)CCN(C)[C@@H](CC(C)C)C(=O)N[C@@H](Cc1ccc(OCc2ccccc2)cc1)C(=O)NC(C)(C)C