Reaction Details
TargetVoltage-dependent N-type calcium channel subunit alpha-1B
LigandBDBM50078727
Substrate/Competitorn/a
Meas. Tech.ChEBML_141444
IC50 200±n/a nM
Citation Ryder, TRHu, LYRafferty, MFMillerman, ESzoke, BGTarczy-Hornoch, K Multiple parallel synthesis of N,N-dialkyldipeptidylamines as N-type calcium channel blockers. Bioorg Med Chem Lett9:1813-8 (1999) Voltage-dependent N-type calcium channel subunit alpha-1B
Name:Voltage-dependent N-type calcium channel subunit alpha-1B
Type:Enzyme
Mol. Mass.:262548.16
Organism:Homo sapiens (Human)
Description:Q00975
Residue:2339
BDBM50078727
NameBDBM50078727
Synonyms:(S)-2-(Cyclohexyl-methyl-amino)-4-methyl-pentanoic acid [(S)-2-(4-benzyloxy-phenyl)-1-tert-butylcarbamoyl-ethyl]-amide | CHEMBL423302
TypeSmall organic molecule
Emp. Form.C33H49N3O3
Mol. Mass.535.7605
SMILESCC(C)C[C@H](N(C)C1CCCCC1)C(=O)N[C@@H](Cc1ccc(OCc2ccccc2)cc1)C(=O)NC(C)(C)C