Reaction Details
TargetVoltage-dependent N-type calcium channel subunit alpha-1B
LigandBDBM50078743
Substrate/Competitorn/a
Meas. Tech.ChEBML_141444
IC50 310±n/a nM
Citation Ryder, TRHu, LYRafferty, MFMillerman, ESzoke, BGTarczy-Hornoch, K Multiple parallel synthesis of N,N-dialkyldipeptidylamines as N-type calcium channel blockers. Bioorg Med Chem Lett9:1813-8 (1999) Voltage-dependent N-type calcium channel subunit alpha-1B
Name:Voltage-dependent N-type calcium channel subunit alpha-1B
Type:Enzyme
Mol. Mass.:262548.16
Organism:Homo sapiens (Human)
Description:Q00975
Residue:2339
BDBM50078743
NameBDBM50078743
Synonyms:(S)-2-(Cyclohexylmethyl-methyl-amino)-4-methyl-pentanoic acid [(S)-2-(4-benzyloxy-phenyl)-1-(1-benzyl-piperidin-4-ylcarbamoyl)-ethyl]-amide | CHEMBL402674
TypeSmall organic molecule
Emp. Form.C42H58N4O3
Mol. Mass.666.9349
SMILESCC(C)C[C@H](N(C)CC1CCCCC1)C(=O)N[C@@H](Cc1ccc(OCc2ccccc2)cc1)C(=O)NC1CCN(Cc2ccccc2)CC1