Reaction Details
TargetVoltage-dependent N-type calcium channel subunit alpha-1B
LigandBDBM50078745
Substrate/Competitorn/a
Meas. Tech.ChEBML_141444
IC50 310±n/a nM
Citation Ryder, TRHu, LYRafferty, MFMillerman, ESzoke, BGTarczy-Hornoch, K Multiple parallel synthesis of N,N-dialkyldipeptidylamines as N-type calcium channel blockers. Bioorg Med Chem Lett9:1813-8 (1999) Voltage-dependent N-type calcium channel subunit alpha-1B
Name:Voltage-dependent N-type calcium channel subunit alpha-1B
Type:Enzyme
Mol. Mass.:262548.16
Organism:Homo sapiens (Human)
Description:Q00975
Residue:2339
BDBM50078745
NameBDBM50078745
Synonyms:(S)-2-[(4-tert-Butyl-benzyl)-methyl-amino]-4-methyl-pentanoic acid [(S)-2-(4-benzyloxy-phenyl)-1-(2-piperidin-1-yl-ethylcarbamoyl)-ethyl]-amide | CHEMBL52699
TypeSmall organic molecule
Emp. Form.C41H58N4O3
Mol. Mass.654.9242
SMILESCC(C)C[C@H](N(C)Cc1ccc(cc1)C(C)(C)C)C(=O)N[C@@H](Cc1ccc(OCc2ccccc2)cc1)C(=O)NCCN1CCCCC1