Reaction Details
TargetMatrix metalloproteinase-9
LigandBDBM50078945
Substrate/Competitorn/a
Meas. Tech.ChEMBL_105378 (CHEMBL712457)
Ki 6±n/a nM
Citation Vassiliou, SMucha, ACuniasse, PGeorgiadis, DLucet-Levannier, KBeau, FKannan, RMurphy, GKnäuper, VRio, MCBasset, PYiotakis, ADive, V Phosphinic pseudo-tripeptides as potent inhibitors of matrix metalloproteinases: a structure-activity study. J Med Chem42:2610-20 (1999) 
 
Matrix metalloproteinase-9
Name:Matrix metalloproteinase-9
Type:Enzyme
Mol. Mass.:78452.28
Organism:Homo sapiens (Human)
Description:P14780
Residue:707
BDBM50078945
NameBDBM50078945
Synonyms:(2-{N-[1-Carbamoyl-2-(1H-indol-3-yl)-ethyl]-hydrazinocarbonyl}-5-phenyl-pentyl)-{1-[2-(3-chloro-phenylamino)-acetylamino]-2-phenyl-ethyl}-phosphinic acid | CHEMBL315843
TypeSmall organic molecule
Emp. Form.C39H44ClN6O5P
Mol. Mass.743.231
SMILESNN(C(Cc1c[nH]c2ccccc12)C(N)=O)C(=O)C(CCCc1ccccc1)CP(O)(=O)C(Cc1ccccc1)NC(=O)CNc1cccc(Cl)c1