Reaction Details
TargetNeutrophil collagenase
LigandBDBM50078946
Substrate/Competitorn/a
Meas. Tech.ChEMBL_105814 (CHEMBL717814)
Ki 5.5±n/a nM
Citation Vassiliou, SMucha, ACuniasse, PGeorgiadis, DLucet-Levannier, KBeau, FKannan, RMurphy, GKnäuper, VRio, MCBasset, PYiotakis, ADive, V Phosphinic pseudo-tripeptides as potent inhibitors of matrix metalloproteinases: a structure-activity study. J Med Chem42:2610-20 (1999) 
 
Neutrophil collagenase
Name:Neutrophil collagenase
Type:Enzyme
Mol. Mass.:53413.48
Organism:Homo sapiens (Human)
Description:P22894
Residue:467
BDBM50078946
NameBDBM50078946
Synonyms:CHEMBL313360 | [1-(2-Benzyloxycarbonylamino-propionylamino)-2-phenyl-ethyl]-(2-{N-[1-carbamoyl-2-(1H-indol-3-yl)-ethyl]-hydrazinocarbonyl}-5-phenyl-pentyl)-phosphinic acid
TypeSmall organic molecule
Emp. Form.C42H49N6O7P
Mol. Mass.780.8482
SMILESCC(NC(=O)OCc1ccccc1)C(=O)NC(Cc1ccccc1)P(O)(=O)CC(CCCc1ccccc1)C(=O)N(N)C(Cc1c[nH]c2ccccc12)C(N)=O