Reaction Details
TargetStromelysin-3
LigandBDBM50078947
Substrate/Competitorn/a
Meas. Tech.ChEMBL_106454 (CHEMBL716816)
Ki 2±n/a nM
Citation Vassiliou, SMucha, ACuniasse, PGeorgiadis, DLucet-Levannier, KBeau, FKannan, RMurphy, GKnäuper, VRio, MCBasset, PYiotakis, ADive, V Phosphinic pseudo-tripeptides as potent inhibitors of matrix metalloproteinases: a structure-activity study. J Med Chem42:2610-20 (1999) 
 
Stromelysin-3
Name:Stromelysin-3
Type:PROTEIN
Mol. Mass.:55452.62
Organism:Mus musculus
Description:ChEMBL_106453
Residue:492
BDBM50078947
NameBDBM50078947
Synonyms:(1-Benzyloxycarbonylamino-2-phenyl-ethyl)-[2-[1-carbamoyl-2-(1H-indol-3-yl)-ethylcarbamoyl]-3-(4-methoxy-benzylsulfanyl)-propyl]-phosphinic acid | CHEMBL277792
TypeSmall organic molecule
Emp. Form.C39H43N4O7PS
Mol. Mass.742.82
SMILESCOc1ccc(CSCC(CP(O)(=O)C(Cc2ccccc2)NC(=O)OCc2ccccc2)C(=O)NC(Cc2c[nH]c3ccccc23)C(N)=O)cc1