Reaction Details
TargetStromelysin-3
LigandBDBM50078949
Substrate/Competitorn/a
Meas. Tech.ChEMBL_106454 (CHEMBL716816)
Ki 22±n/a nM
Citation Vassiliou, SMucha, ACuniasse, PGeorgiadis, DLucet-Levannier, KBeau, FKannan, RMurphy, GKnäuper, VRio, MCBasset, PYiotakis, ADive, V Phosphinic pseudo-tripeptides as potent inhibitors of matrix metalloproteinases: a structure-activity study. J Med Chem42:2610-20 (1999) 
 
Stromelysin-3
Name:Stromelysin-3
Type:PROTEIN
Mol. Mass.:55452.62
Organism:Mus musculus
Description:ChEMBL_106453
Residue:492
BDBM50078949
NameBDBM50078949
Synonyms:(1-Benzyloxycarbonylamino-2-phenyl-ethyl)-{2-[1-carbamoyl-2-(1H-indol-3-yl)-ethylcarbamoyl]-4-methyl-pentyl}-phosphinic acid | CHEMBL85744
TypeSmall organic molecule
Emp. Form.C34H41N4O6P
Mol. Mass.632.6863
SMILESCC(C)CC(CP(O)(=O)C(Cc1ccccc1)NC(=O)OCc1ccccc1)C(=O)NC(Cc1c[nH]c2ccccc12)C(N)=O