Reaction Details
TargetNeutrophil collagenase
LigandBDBM50078930
Substrate/Competitorn/a
Meas. Tech.ChEMBL_105814 (CHEMBL717814)
Ki 2.5±n/a nM
Citation Vassiliou, SMucha, ACuniasse, PGeorgiadis, DLucet-Levannier, KBeau, FKannan, RMurphy, GKnäuper, VRio, MCBasset, PYiotakis, ADive, V Phosphinic pseudo-tripeptides as potent inhibitors of matrix metalloproteinases: a structure-activity study. J Med Chem42:2610-20 (1999) 
 
Neutrophil collagenase
Name:Neutrophil collagenase
Type:Enzyme
Mol. Mass.:53413.48
Organism:Homo sapiens (Human)
Description:P22894
Residue:467
BDBM50078930
NameBDBM50078930
Synonyms:(1-Benzyloxycarbonylamino-2-phenyl-ethyl)-{2-[(R)-1-carbamoyl-2-(1H-indol-3-yl)-ethylcarbamoyl]-5-phenyl-pentyl}-phosphinic acid | CHEMBL328886
TypeSmall organic molecule
Emp. Form.C39H43N4O6P
Mol. Mass.694.7557
SMILESNC(=O)[C@@H](Cc1c[nH]c2ccccc12)NC(=O)C(CCCc1ccccc1)CP(O)(=O)C(Cc1ccccc1)NC(=O)OCc1ccccc1