Reaction Details
TargetMatrilysin
LigandBDBM50078935
Substrate/Competitorn/a
Meas. Tech.ChEMBL_105050 (CHEMBL711564)
Ki 117±n/a nM
Citation Vassiliou, SMucha, ACuniasse, PGeorgiadis, DLucet-Levannier, KBeau, FKannan, RMurphy, GKnäuper, VRio, MCBasset, PYiotakis, ADive, V Phosphinic pseudo-tripeptides as potent inhibitors of matrix metalloproteinases: a structure-activity study. J Med Chem42:2610-20 (1999) 
 
Matrilysin
Name:Matrilysin
Type:Enzyme
Mol. Mass.:29681.54
Organism:Homo sapiens (Human)
Description:P09237
Residue:267
BDBM50078935
NameBDBM50078935
Synonyms:(2-{N-[1-Carbamoyl-2-(1H-indol-3-yl)-ethyl]-hydrazinocarbonyl}-5-phenyl-pentyl)-{1-[(4,6-dichloro-1H-indole-2-carbonyl)-amino]-2-phenyl-ethyl}-phosphinic acid | CHEMBL89057
TypeSmall organic molecule
Emp. Form.C40H41Cl2N6O5P
Mol. Mass.787.671
SMILESNN(C(Cc1c[nH]c2ccccc12)C(N)=O)C(=O)C(CCCc1ccccc1)CP(O)(=O)C(Cc1ccccc1)NC(=O)c1cc2c(Cl)cc(Cl)cc2[nH]1