Reaction Details
TargetNeuropeptide Y receptor type 1
LigandBDBM50078958
Substrate/Competitorn/a
Meas. Tech.ChEMBL_143983 (CHEMBL752582)
Ki>10±n/a nM
Citation Murakami, YHara, HOkada, THashizume, HKii, MIshihara, YIshikawa, MShimamura, MMihara, SKato, GHanasaki, KHagishita, SFujimoto, M 1,3-Disubstituted benzazepines as novel, potent, selective neuropeptide Y Y1 receptor antagonists. J Med Chem42:2621-32 (1999) 
 
Neuropeptide Y receptor type 1
Name:Neuropeptide Y receptor type 1
Type:Enzyme Catalytic Domain
Mol. Mass.:44399.07
Organism:Homo sapiens (Human)
Description:NPY-Y1 NPY1R HUMAN::P25929
Residue:384
BDBM50078958
NameBDBM50078958
Synonyms:CHEMBL433216 | {3-[2-Oxo-3-(3-phenyl-ureido)-2,3,4,5-tetrahydro-benzo[b]azepin-1-ylmethyl]-phenyl}-carbamic acid methyl ester
TypeSmall organic molecule
Emp. Form.C26H26N4O4
Mol. Mass.458.509
SMILESCOC(=O)Nc1cccc(CN2c3ccccc3CCC(NC(=O)Nc3ccccc3)C2=O)c1