Reaction Details
TargetProthrombin
LigandBDBM50079230
Substrate/Competitorn/a
Meas. Tech.ChEMBL_208541 (CHEMBL813635)
Ki 8400±n/a nM
Citation Quan, MLEllis, CDLiauw, AYAlexander, RSKnabb, RMLam, GWright, MRWong, PCWexler, RR Design and synthesis of isoxazoline derivatives as factor Xa inhibitors. 2. J Med Chem42:2760-73 (1999) 
 
Prothrombin
Name:Prothrombin
Type:Protein
Mol. Mass.:70029.57
Organism:Homo sapiens (Human)
Description:P00734
Residue:622
BDBM50079230
NameBDBM50079230
Synonyms:3-(3-Carbamimidoyl-phenyl)-5-ethoxymethyl-4,5-dihydro-isoxazole-5-carboxylic acid [5-(2-sulfamoyl-phenyl)-pyridin-2-yl]-amide; TFA CHEMBL318112
TypeSmall organic molecule
Emp. Form.C25H26N6O5S
Mol. Mass.522.576
SMILESCCOCC1(CC(=NO1)c1cccc(c1)C(N)=N)C(=O)Nc1ccc(cn1)-c1ccccc1S(N)(=O)=O