Reaction Details
TargetCoagulation factor X
LigandBDBM50079255
Substrate/Competitorn/a
Meas. Tech.ChEMBL_49167 (CHEMBL663266)
Ki 4.3±n/a nM
Citation Quan, MLEllis, CDLiauw, AYAlexander, RSKnabb, RMLam, GWright, MRWong, PCWexler, RR Design and synthesis of isoxazoline derivatives as factor Xa inhibitors. 2. J Med Chem42:2760-73 (1999) 
 
Coagulation factor X
Name:Coagulation factor X
Type:Enzyme
Mol. Mass.:54726.60
Organism:Homo sapiens (Human)
Description:n/a
Residue:488
BDBM50079255
NameBDBM50079255
Synonyms:3-(3-Carbamimidoyl-phenyl)-5-isopropoxymethyl-4,5-dihydro-isoxazole-5-carboxylic acid (2'-sulfamoyl-biphenyl-4-yl)-amide; TFA | CHEMBL327473
TypeSmall organic molecule
Emp. Form.C27H29N5O5S
Mol. Mass.535.615
SMILESCC(C)OCC1(CC(=NO1)c1cccc(c1)C(N)=N)C(=O)Nc1ccc(cc1)-c1ccccc1S(N)(=O)=O