Reaction Details
TargetSerine protease 1
LigandBDBM50079211
Substrate/Competitorn/a
Meas. Tech.ChEMBL_212878 (CHEMBL824706)
Ki 52±n/a nM
Citation Quan, MLEllis, CDLiauw, AYAlexander, RSKnabb, RMLam, GWright, MRWong, PCWexler, RR Design and synthesis of isoxazoline derivatives as factor Xa inhibitors. 2. J Med Chem42:2760-73 (1999) 
 
Serine protease 1
Name:Serine protease 1
Type:Enzyme
Mol. Mass.:26557.80
Organism:Homo sapiens (Human)
Description:P07477
Residue:247
BDBM50079211
NameBDBM50079211
Synonyms:CHEMBL327404 | {3-(3-Carbamimidoyl-phenyl)-5-[5-(2-sulfamoyl-phenyl)-pyridin-2-ylcarbamoyl]-4,5-dihydro-isoxazol-5-yl}-acetic acid methyl ester; TFA
TypeSmall organic molecule
Emp. Form.C25H24N6O6S
Mol. Mass.536.56
SMILESCOC(=O)CC1(CC(=NO1)c1cccc(c1)C(N)=N)C(=O)Nc1ccc(cn1)-c1ccccc1S(N)(=O)=O