Reaction Details
TargetSerine protease 1
LigandBDBM50079240
Substrate/Competitorn/a
Meas. Tech.ChEMBL_212878 (CHEMBL824706)
Ki 31±n/a nM
Citation Quan, MLEllis, CDLiauw, AYAlexander, RSKnabb, RMLam, GWright, MRWong, PCWexler, RR Design and synthesis of isoxazoline derivatives as factor Xa inhibitors. 2. J Med Chem42:2760-73 (1999) 
 
Serine protease 1
Name:Serine protease 1
Type:Enzyme
Mol. Mass.:26557.80
Organism:Homo sapiens (Human)
Description:P07477
Residue:247
BDBM50079240
NameBDBM50079240
Synonyms:3-(3-Carbamimidoyl-phenyl)-5-tetrazol-1-ylmethyl-4,5-dihydro-isoxazole-5-carboxylic acid [5-(2-sulfamoyl-phenyl)-pyridin-2-yl]-amide; TFA CHEMBL93210
TypeSmall organic molecule
Emp. Form.C24H22N10O4S
Mol. Mass.546.561
SMILESNC(=N)c1cccc(c1)C1=NOC(Cn2cnnn2)(C1)C(=O)Nc1ccc(cn1)-c1ccccc1S(N)(=O)=O