Reaction Details
TargetKallikrein-1
LigandBDBM50079380
Substrate/Competitorn/a
Meas. Tech.ChEMBL_92369 (CHEMBL701583)
Ki>10000000±n/a nM
Citation Sanders, TCSeto, CT 4-Heterocyclohexanone-based inhibitors of the serine protease plasmin. J Med Chem42:2969-76 (1999) 
 
Kallikrein-1
Name:Kallikrein-1
Type:Enzyme
Mol. Mass.:28874.69
Organism:Homo sapiens (Human)
Description:P06870
Residue:262
BDBM50079380
NameBDBM50079380
Synonyms:3-[Bis-(6-amino-hexyl)-amino]-tetrahydro-thiopyran-4-one | CHEMBL318854
TypeSmall organic molecule
Emp. Form.C17H35N3OS
Mol. Mass.329.544
SMILESNCCCCCCN(CCCCCCN)C1CSCCC1=O