Reaction Details
TargetProthrombin
LigandBDBM50079381
Substrate/Competitorn/a
Meas. Tech.ChEMBL_208330 (CHEMBL813562)
Ki 630000±n/a nM
Citation Sanders, TCSeto, CT 4-Heterocyclohexanone-based inhibitors of the serine protease plasmin. J Med Chem42:2969-76 (1999) 
 
Prothrombin
Name:Prothrombin
Type:Protein
Mol. Mass.:70029.57
Organism:Homo sapiens (Human)
Description:P00734
Residue:622
BDBM50079381
NameBDBM50079381
Synonyms:(R)-2-Amino-3-methyl-pentanoic acid {(S)-1-[(6-amino-hexyl)-(4-oxo-tetrahydro-thiopyran-3-yl)-carbamoyl]-2-phenyl-ethyl}-amide | CHEMBL2370338
TypeSmall organic molecule
Emp. Form.C26H42N4O3S
Mol. Mass.490.702
SMILESCC[C@H](C)[C@@H](N)C(=O)N[C@@H](Cc1ccccc1)C(=O)N(CCCCCCN)C1CSCCC1=O