Reaction Details
TargetSerine protease 1
LigandBDBM50079381
Substrate/Competitorn/a
Meas. Tech.ChEMBL_212737 (CHEMBL816555)
Ki 630000±n/a nM
Citation Sanders, TCSeto, CT 4-Heterocyclohexanone-based inhibitors of the serine protease plasmin. J Med Chem42:2969-76 (1999) 
 
Serine protease 1
Name:Serine protease 1
Type:Enzyme
Mol. Mass.:26557.80
Organism:Homo sapiens (Human)
Description:P07477
Residue:247
BDBM50079381
NameBDBM50079381
Synonyms:(R)-2-Amino-3-methyl-pentanoic acid {(S)-1-[(6-amino-hexyl)-(4-oxo-tetrahydro-thiopyran-3-yl)-carbamoyl]-2-phenyl-ethyl}-amide | CHEMBL2370338
TypeSmall organic molecule
Emp. Form.C26H42N4O3S
Mol. Mass.490.702
SMILESCC[C@H](C)[C@@H](N)C(=O)N[C@@H](Cc1ccccc1)C(=O)N(CCCCCCN)C1CSCCC1=O