Reaction Details
TargetMu-type opioid receptor
LigandBDBM50079413
Substrate/Competitorn/a
Meas. Tech.ChEMBL_149330 (CHEMBL756364)
Ki 2±n/a nM
Citation Wan, QMurray, TFAldrich, JV A novel acetylated analogue of dynorphin A-(1-11) amide as a kappa-opioid receptor antagonist. J Med Chem42:3011-3 (1999) 
 
Mu-type opioid receptor
Name:Mu-type opioid receptor
Type:G Protein-Coupled Receptor (GPCR)
Mol. Mass.:44789.51
Organism:Homo sapiens (Human)
Description:P35372
Residue:400
BDBM50079413
NameBDBM50079413
Synonyms:CHEMBL407084 Tyr-Gly-Gly-Phe-Leu-Arg-Arg-D-Ala-Arg-Pro-Lys-NH2
TypeSmall organic molecule
Emp. Form.C60H98N22O12
Mol. Mass.1319.5603
SMILESCC(C)C[C@H](NC(=O)[C@H](Cc1ccccc1)NC(=O)CNC(=O)CNC(=O)[C@@H](N)Cc1ccc(O)cc1)C(=O)N[C@@H](CCCN=C(N)N)C(=O)N[C@@H](CCCN=C(N)N)C(=O)N[C@H](C)C(=O)N[C@@H](CCCN=C(N)N)C(=O)N1CCC[C@H]1C(=O)N[C@@H](CCCCN)C(N)=O