Reaction Details
TargetEndothelin-1 receptor
LigandBDBM50079416
Substrate/Competitorn/a
Meas. Tech.ChEMBL_65646 (CHEMBL678558)
Ki 39.3±n/a nM
Citation Amberg, WHergenröder, SHillen, HJansen, RKettschau, GKling, AKlinge, DRaschack, MRiechers, HUnger, L Discovery and synthesis of (S)-3-[2-(3,4-dimethoxyphenyl)ethoxy]-2- (4,6-dimethylpyrimidin-2-yloxy)-3,3-diphenylpropionic acid (LU 302872), a novel orally active mixed ET(A)/ET(B) receptor antagonist. J Med Chem42:3026-32 (1999) 
 
Endothelin-1 receptor
Name:Endothelin-1 receptor
Type:Enzyme Catalytic Domain
Mol. Mass.:48736.88
Organism:Homo sapiens (Human)
Description:P25101
Residue:427
BDBM50079416
NameBDBM50079416
Synonyms:3-[2-(3,4-Dimethoxy-phenyl)-ethoxy]-3,3-bis-(4-ethyl-phenyl)-2-(4-methoxy-6-methyl-pyrimidin-2-yloxy)-propionic acid | CHEMBL318535
TypeSmall organic molecule
Emp. Form.C35H40N2O7
Mol. Mass.600.7013
SMILESCCc1ccc(cc1)C(OCCc1ccc(OC)c(OC)c1)(C(Oc1nc(C)cc(OC)n1)C(O)=O)c1ccc(CC)cc1